{"text_format":"3","workbook":"xlsx","n_sheets":5,"sheets":["Supplier Declaration","List of purchased products","List of substance declarations","Instruction Sheet","Language"],"not_rendered":{"defined_names":2,"comments":2},"read":"whole","date_system":"1900"}

{"sheet":"Supplier Declaration","index":0,"n_rows":66,"n_cols":34,"rows_kept":66,"merged":[[0,1,0,3],[0,15,0,21],[2,0,2,23],[5,17,5,20],[5,21,5,22],[7,1,7,5],[7,6,7,11],[7,12,7,16],[7,17,7,22],[8,1,8,5],[8,6,8,11],[8,12,8,16],[8,17,8,22],[9,1,9,5],[9,6,9,11],[9,12,9,16],[9,17,9,22],[10,1,10,5],[10,6,10,11],[10,12,10,16],[10,17,10,22],[14,1,14,22],[15,10,15,11],[15,12,15,19],[15,20,15,22],[16,2,16,9],[16,10,16,11],[16,12,16,19],[16,20,16,22],[17,1,19,1],[17,2,17,9],[17,10,19,11],[17,12,19,19],[17,20,19,22],[18,2,18,9],[19,2,19,9],[20,1,22,1],[20,2,20,9],[20,10,22,11],[20,12,22,19],[20,20,22,22],[21,2,21,9],[22,2,22,9],[23,1,25,1],[23,2,23,9],[23,10,25,11],[23,12,25,19],[23,20,25,22],[24,2,24,9],[25,2,25,9],[26,1,28,1],[26,2,26,9],[26,10,28,11],[26,12,28,19],[26,20,28,22],[27,2,28,9],[29,1,31,1],[29,2,29,9],[29,10,31,11],[29,12,31,19],[29,20,31,22],[30,2,31,9],[32,1,34,1],[32,2,32,9],[32,10,34,11],[32,12,34,19],[32,20,34,22],[33,2,34,9],[35,1,37,1],[35,2,35,9],[35,10,37,11],[35,12,37,19],[35,20,37,22],[36,2,37,9],[38,1,40,1],[38,2,38,9],[38,10,40,11],[38,12,40,19],[38,20,40,22],[39,2,40,9],[44,1,44,7],[44,8,44,10],[44,11,44,13],[44,14,44,16],[44,17,44,22],[45,1,45,7],[45,8,45,10],[45,11,45,13],[45,14,45,16],[45,17,45,22],[46,1,46,7],[46,8,46,10],[46,11,46,13],[46,14,46,16],[46,17,46,22],[47,1,47,7],[47,8,47,10],[47,11,47,13],[47,14,47,16],[47,17,47,22],[48,1,48,7],[48,8,48,10],[48,11,48,13],[48,14,48,16],[48,17,48,22],[49,1,49,7],[49,8,49,10],[49,11,49,13],[49,14,49,16],[49,17,49,22],[50,1,50,7],[50,8,50,10],[50,11,50,13],[50,14,50,16],[50,17,50,22],[51,1,51,7],[51,8,51,10],[51,11,51,13],[51,14,51,16],[51,17,51,22],[52,1,52,7],[52,8,52,10],[52,11,52,13],[52,14,52,16],[52,17,52,22],[58,1,58,22],[62,1,62,4],[62,6,62,10],[67,21,67,23]]}
[null,"Sprachauswahl\nSelect Language",null,null,"u",{"$nulls":10},{"$f":"HLOOKUP(Language!$A$2,Language!$C$6:$D$543,2)","v":"So erstellen Sie die Zulieferererklärung."}]
[]
[{"$f":"HLOOKUP(Language!$A$2,Language!$C$6:$D$543,3)","v":"Zulieferererklärung"}]
[]
[]
[null,{"$f":"HLOOKUP(Language!$A$2,Language!$C$6:$D$543,4)","v":"[1] Lieferant"},{"$nulls":10},{"$f":"HLOOKUP(Language!A2,Language!C6:D543,9)","v":"[2] Produkt"},{"$nulls":4},{"$f":"HLOOKUP(Language!$A$2,Language!$C$6:$D$543,10)","v":"Zusätzliches Blatt*¹"},{"$nulls":11},{"$f":"(ISBLANK(V6)=FALSE)","v":false}]
[]
[null,{"$f":"HLOOKUP(Language!$A$2,Language!$C$6:$D$543,5)","v":"Firmenname"},{"$nulls":10},{"$f":"HLOOKUP(Language!$A$2,Language!$C$6:$D$543,11)","v":"Lieferant Materialnummer"},{"$nulls":16},{"$f":"(ISBLANK(G8)=FALSE)","v":false},{"$f":"(ISBLANK(R8)=FALSE)","v":false}]
[null,{"$f":"HLOOKUP(Language!$A$2,Language!$C$6:$D$543,6)","v":"Kontaktperson"},{"$nulls":10},{"$f":"HLOOKUP(Language!$A$2,Language!$C$6:$D$543,12)","v":"Lieferant Materialbezeichnung"},{"$nulls":16},{"$f":"(ISBLANK(G9)=FALSE)","v":false},{"$f":"(ISBLANK(R9)=FALSE)","v":false}]
[null,{"$f":"HLOOKUP(Language!$A$2,Language!$C$6:$D$543,7)","v":"Telefonnummer"},{"$nulls":10},{"$f":"HLOOKUP(Language!$A$2,Language!$C$6:$D$543,13)","v":"RZB Materialnummer"},{"$nulls":16},{"$f":"(ISBLANK(G10)=FALSE)","v":false},{"$f":"(ISBLANK(R10)=FALSE)","v":false}]
[null,{"$f":"HLOOKUP(Language!$A$2,Language!$C$6:$D$543,8)","v":"E-Mail "},{"$nulls":10},{"$f":"HLOOKUP(Language!$A$2,Language!$C$6:$D$543,14)","v":"RZB Materialbezeichnung"},{"$nulls":16},{"$f":"(ISBLANK(G11)=FALSE)","v":false},{"$f":"(ISBLANK(R11)=FALSE)","v":false}]
[]
[null,"*¹ = ",{"$f":"HLOOKUP(Language!$A$2,Language!$C$6:$D$543,15)","v":"Soll diese Erklärung für mehrere Produkte/ Produktgruppen genutzt werden, steht das Tabellenblatt \"List of purchased products\" zur Verfügung."}]
[]
[null,{"$f":"HLOOKUP(Language!$A$2,Language!$C$6:$D$543,16)","v":"Hiermit bestätigten wir, dass das Produkt/ die Produkte die folgenden Rechtsvorschriften zur Beschränkung von gefährlichen Stoffen in Produkten einhält."}]
[{"$nulls":10},"[3]",null,"[4]",{"$nulls":7},"[5]"]
[null,{"$f":"HLOOKUP(Language!$A$2,Language!$C$6:$D$543,17)","v":"Nr."},{"$f":"HLOOKUP(Language!$A$2,Language!$C$6:$D$543,18)","v":"Rechtsvorschrift"},{"$nulls":7},{"$f":"HLOOKUP(Language!$A$2,Language!$C$6:$D$543,32)","v":"Konformität "},null,{"$f":"HLOOKUP(Language!$A$2,Language!$C$6:$D$543,33)","v":"Konformitätserklärung "},{"$nulls":7},{"$f":"HLOOKUP(Language!$A$2,Language!$C$6:$D$543,34)","v":"Bewertungs-verfahren"}]
[null,1,{"$f":"HLOOKUP(Language!$A$2,Language!$C$6:$D$543,19)","v":"REACh Verordnung (EG) Nr. 1907/2006"},{"$nulls":25},{"$f":"(ISBLANK(K18)=TRUE)","v":true},{"$f":"IF(OR(K18=\"Einhaltung\",K18=\"Nichteinhaltung\",K18=\"Compliance\",K18=\"Non-compliance\"),TRUE,FALSE)","v":false},{"$f":"(ISBLANK(M18)=FALSE)","v":false},{"$f":"IF(OR($M$18=\"Besonders besorgniserregende Stoffe (SVHC) der Kandidatenliste in Konzentration unter 0,1 Massenprozent enthalten. \",$M$18=\"Besonders besorgniserregende Stoffe (SVHC) der Kandidatenliste in Konzentration über 0,1 Massenprozent enthalten.\",$M$18=\"Does contain substances of very high concern (SVHC) in the candidate list of concentrations below 0.1 % by mass.\",$M$18=\"Does contain substances of very high concern (SVHC) in the candidate list of concentrations above 0.1 % by mass.\"),TRUE,FALSE)","v":false},{"$f":"IF(ISBLANK(U18),\"FALSCH\",\"WAHR\")","v":"FALSCH"}]
[null,null,{"$f":"HLOOKUP(Language!$A$2,Language!$C$6:$D$543,20)","v":"SVHC Kandidatenliste 16. Juni 2019 (201 Stoffe)"}]
[null,null,{"$f":"HLOOKUP(Language!$A$2,Language!$C$6:$D$543,29)","v":"gilt für alle Zukaufprodukte und Verpackungen."}]
[null,"2",{"$f":"HLOOKUP(Language!$A$2,Language!$C$6:$D$543,19)","v":"REACh Verordnung (EG) Nr. 1907/2006"},{"$nulls":25},{"$f":"(ISBLANK(K21)=TRUE)","v":true},{"$f":"IF(OR(K21=\"Einhaltung\",K21=\"Nichteinhaltung\",K21=\"Compliance\",K21=\"Non-compliance\"),TRUE,FALSE)","v":false},{"$f":"(ISBLANK(M21)=FALSE)","v":false},{"$f":"IF(OR($M$21=\"Zulassungspflichtige Stoffe gemäß Anhang XIV enthalten, jedoch durch Verwendung einer eingetragenen Zulassung.\",$M$21=\"Zulassungspflichtige Stoffe gemäß Anhang XIV enthalten, ohne Verwendung einer eingetragenen Zulassung.\",$M$21=\"Does contain substances according to the authorisation list in annex XIV, by using a registered authorisation.\",$M$21=\"Does contain substances according to the authorisation list in annex XIV, without the use of a registered authorisation.\"),TRUE,FALSE)","v":false},{"$f":"IF(ISBLANK(U21),\"FALSCH\",\"WAHR\")","v":"FALSCH"}]
[null,null,{"$f":"HLOOKUP(Language!$A$2,Language!$C$6:$D$543,21)","v":"Anhang XIV plus Änderungen bis zum 13. Juni 2017"}]
[null,null,{"$f":"HLOOKUP(Language!$A$2,Language!$C$6:$D$543,29)","v":"gilt für alle Zukaufprodukte und Verpackungen."}]
[null,"3",{"$f":"HLOOKUP(Language!$A$2,Language!$C$6:$D$543,19)","v":"REACh Verordnung (EG) Nr. 1907/2006"},{"$nulls":25},{"$f":"(ISBLANK(K24)=TRUE)","v":true},{"$f":"IF(OR(K24=\"Einhaltung\",K24=\"Nichteinhaltung\",K24=\"Compliance\",K24=\"Non-compliance\"),TRUE,FALSE)","v":false},{"$f":"(ISBLANK(M24)=FALSE)","v":false},{"$f":"IF(OR($M$24=\"Die Beschränkungen im Anhang XVII werden nicht eingehalten.\",$M$24=\"The restrictions in annex XVII shall not be complied with.\"),TRUE,FALSE)","v":false},{"$f":"IF(ISBLANK(U24),\"FALSCH\",\"WAHR\")","v":"FALSCH"}]
[null,null,{"$f":"HLOOKUP(Language!$A$2,Language!$C$6:$D$543,22)","v":"Anhang XVII plus Änderungen bis zum 16. August 2019"}]
[null,null,{"$f":"HLOOKUP(Language!$A$2,Language!$C$6:$D$543,29)","v":"gilt für alle Zukaufprodukte und Verpackungen."}]
[null,4,{"$f":"HLOOKUP(Language!$A$2,Language!$C$6:$D$543,23)","v":"Chemikalien-Verbotsverordnung ChemVerbotsV"},{"$nulls":25},{"$f":"(ISBLANK(K27)=TRUE)","v":true},{"$f":"IF(OR(K27=\"Einhaltung\",K27=\"Nichteinhaltung\",K27=\"Compliance\",K27=\"Non-compliance\"),TRUE,FALSE)","v":false},{"$f":"(ISBLANK(M27)=FALSE)","v":false},{"$f":"IF(OR($M$27=\"Gefährliche Stoffe/Gemische gemäß Anlage I enthalten, jedoch durch Verwendung einer zulässigen Ausnahme.\",$M$27=\"Gefährliche Stoffe/Gemische gemäß Anlage I enthalten, ohne Verwendung einer zulässigen Ausnahme.\",$M$27=\"Does contain hazardous substances/mixtures according to appendix I, by using a permitted exception.\",$M$27=\"Does contain hazardous substances/mixtures according to appendix I, without the use of a permitted exception.\"),TRUE,FALSE)","v":false},"FALSCH"]
[null,null,{"$f":"HLOOKUP(Language!$A$2,Language!$C$6:$D$543,29)","v":"gilt für alle Zukaufprodukte und Verpackungen."}]
[]
[null,5,{"$f":"HLOOKUP(Language!$A$2,Language!$C$6:$D$543,24)","v":"POP Verordnung (EG) Nr. 2019/1021"},{"$nulls":25},{"$f":"(ISBLANK(K30)=TRUE)","v":true},{"$f":"IF(OR(K30=\"Einhaltung\",K30=\"Nichteinhaltung\",K30=\"Compliance\",K30=\"Non-compliance\"),TRUE,FALSE)","v":false},{"$f":"(ISBLANK(M30)=FALSE)","v":false},{"$f":"IF(OR($M$30=\"Beschränkte Stoffe gemäß Anhang II enthalten, jedoch durch Verwendung einer zulässigen Ausnahme.\",$M$30=\"Verbotene Stoffe gemäß Anhang I enthalten.\",$M$30=\"Beschränkte Stoffe gemäß Anhang II enthalten.\",$M$30=\"Does contain restricted substances listed in annex II, however by using a permitted exception.\",$M$30=\"Does contain prohibited substances listed in Annex I.\",$M$30=\"Does contain restricted substances listed in annex II.\"),TRUE,FALSE)","v":false},"FALSCH"]
[null,null,{"$f":"HLOOKUP(Language!$A$2,Language!$C$6:$D$543,29)","v":"gilt für alle Zukaufprodukte und Verpackungen."}]
[]
[null,6,{"$f":"HLOOKUP(Language!$A$2,Language!$C$6:$D$543,25)","v":"Verpackungsrichtlinie 94/62/EG"},{"$nulls":25},{"$f":"(ISBLANK(K33)=TRUE)","v":true},{"$f":"IF(OR(K33=\"Einhaltung\",K33=\"Nichteinhaltung\",K33=\"Compliance\",K33=\"Non-compliance\"),TRUE,FALSE)","v":false},{"$f":"(ISBLANK(M33)=FALSE)","v":false},{"$f":"IF(OR($M$33=\"Verbotene Schwermetalle im Sinne von Artikel 11 enthalten, jedoch unterhalb der maximalen Höchstkonzentration.\",$M$33=\"Verbotene Schwermetalle im Sinne von Artikel 11 enthalten, die oberhalb der maximalen Höchstkonzentration sind.\",$M$33=\"Does contain prohibited heavy metals as referred in article 11, however but below the maximum ceiling concentration.\",$M$33=\"Does contain prohibited heavy metals as referred in article 11, which are above the maximum ceiling concentration.\"),TRUE,FALSE)","v":false},{"$f":"IF(ISBLANK(U33),\"FALSCH\",\"WAHR\")","v":"FALSCH"}]
[null,null,{"$f":"HLOOKUP(Language!$A$2,Language!$C$6:$D$543,26)","v":"gilt für alle Verpackungsmaterialien für die Produktion und für Verkaufsprodukte."}]
[]
[null,7,{"$f":"HLOOKUP(Language!$A$2,Language!$C$6:$D$543,27)","v":"RoHS-Richtlinie 2011/65/EU inkl. (EU) 2015/863 "},{"$nulls":25},{"$f":"(ISBLANK(K36)=TRUE)","v":true},{"$f":"IF(OR(K36=\"Einhaltung\",K36=\"Nichteinhaltung\",K36=\"Compliance\",K36=\"Non-compliance\"),TRUE,FALSE)","v":false},{"$f":"(ISBLANK(M36)=FALSE)","v":false},{"$f":"IF(OR($M$36=\"Deklarationspflichtige Stoffe enthalten, jedoch unterhalb der zulässigen Höchstkonzentration.\",$M$36=\"Deklarationspflichtige Stoffe enthalten, die oberhalb der zulässigen Höchstkonzentration sind, durch Verwendung einer Ausnahme im Anhang III.\",$M$36=\"Deklarationspflichtige Stoffe enthalten, die oberhalb der Höchstkonzentration sind.\",$M$36=\"Does contain restricted substances according to annex II, however but below the maximum ceiling concentration.\",$M$36=\"Does contain restricted substances above the maximum ceiling concentration by using a permitted exception in annex III.\",$M$36=\"Does contain restricted substances  above the maximum ceiling concentration.\"),TRUE,FALSE)","v":false},"FALSCH"]
[null,null,{"$f":"HLOOKUP(Language!$A$2,Language!$C$6:$D$543,28)","v":"gilt für alle Zukaufprodukte die in Elektronikgeräte einfließen."}]
[]
[null,8,{"$f":"HLOOKUP(Language!$A$2,Language!$C$6:$D$543,30)","v":"Batterierichtlinie 2006/66/EG "},{"$nulls":25},{"$f":"(ISBLANK(K39)=TRUE)","v":true},{"$f":"IF(OR(K39=\"Einhaltung\",K39=\"Nichteinhaltung\",K39=\"Compliance\",K39=\"Non-compliance\"),TRUE,FALSE)","v":false},{"$f":"(ISBLANK(M39)=FALSE)","v":false},{"$f":"IF(OR($M$39=\"Verbotene Schwermetalle im Sinne von Artikel 4 enthalten, jedoch unterhalb der maximalen Höchstkonzentration.\",$M$39=\"Verbotene Schwermetalle im Sinne von Artikel 4 enthalten, die oberhalb der maximalen Höchstkonzentration sind.\",$M$39=\"Does contain prohibited heavy metals as referred in article 4, however but below the maximum ceiling concentration.\",$M$39=\"Does contain prohibited heavy metals as referred in article 4, which are above the maximum ceiling concentration.\"),TRUE,FALSE)","v":false},{"$f":"IF(ISBLANK(U39),\"FALSCH\",\"WAHR\")","v":"FALSCH"}]
[null,null,{"$f":"HLOOKUP(Language!$A$2,Language!$C$6:$D$543,31)","v":"gilt für alle Batterien und Akkumulatoren, sofern keine Verwendung für Notbeleuchtung vorliegt."}]
{"$rows_left_out":20}
{"sheet":"List of purchased products","index":1,"n_rows":8,"n_cols":5,"rows_kept":8,"merged":[[0,0,0,5]]}
[{"$f":"HLOOKUP(Language!$A$2,Language!$C$6:$D$543,3)","v":"Zulieferererklärung"}]
[]
[]
[null,{"$f":"HLOOKUP(Language!$A$2,Language!$C$6:$D$543,50)","v":"Liste der Zukaufprodukte - Fortsetzung Seite 1 "}]
[]
[null,{"$f":"HLOOKUP(Language!$A$2,Language!$C$6:$D$543,5)","v":"Firmenname"},{"$f":"'Supplier Declaration'!G8","v":0},{"$f":"HLOOKUP(Language!$A$2,Language!$C$6:$D$543,6)","v":"Kontaktperson"},{"$f":"'Supplier Declaration'!G9","v":0}]
[]
[null,{"$f":"HLOOKUP(Language!$A$2,Language!$C$6:$D$543,11)","v":"Lieferant Materialnummer"},{"$f":"HLOOKUP(Language!$A$2,Language!$C$6:$D$543,12)","v":"Lieferant Materialbezeichnung"},{"$f":"HLOOKUP(Language!$A$2,Language!$C$6:$D$543,13)","v":"RZB Materialnummer"},{"$f":"HLOOKUP(Language!$A$2,Language!$C$6:$D$543,14)","v":"RZB Materialbezeichnung"}]

{"sheet":"List of substance declarations","index":2,"n_rows":8,"n_cols":6,"rows_kept":8,"merged":[[0,0,0,6],[5,2,5,3]]}
[{"$f":"HLOOKUP(Language!$A$2,Language!$C$6:$D$543,3)","v":"Zulieferererklärung"}]
[]
[]
[null,{"$f":"HLOOKUP(Language!$A$2,Language!$C$6:$D$543,51)","v":"Liste der Stoffdeklarationen - Fortsetzung der Seite 1"}]
[]
[null,{"$f":"HLOOKUP(Language!$A$2,Language!$C$6:$D$543,5)","v":"Firmenname"},{"$f":"'Supplier Declaration'!G8","v":0},null,{"$f":"HLOOKUP(Language!$A$2,Language!$C$6:$D$543,6)","v":"Kontaktperson"},{"$f":"'Supplier Declaration'!G9","v":0}]
[]
[null,{"$f":"HLOOKUP(Language!$A$2,Language!$C$6:$D$543,36)","v":"Angaben zu Stoff/Stoffgruppe"},{"$f":"HLOOKUP(Language!$A$2,Language!$C$6:$D$543,37)","v":"CAS-Nr."},{"$f":"HLOOKUP(Language!$A$2,Language!$C$6:$D$543,52)","v":"Stoffkonzentration"},{"$f":"HLOOKUP(Language!$A$2,Language!$C$6:$D$543,18)","v":"Rechtsvorschrift"},{"$f":"HLOOKUP(Language!$A$2,Language!$C$6:$D$543,53)","v":"Zusätzliche Angaben"}]

{"sheet":"Instruction Sheet","index":3,"n_rows":71,"n_cols":20,"rows_kept":71,"merged":[[0,0,0,25],[5,2,5,24],[6,2,6,24],[7,2,7,24],[9,1,9,24],[11,2,11,24],[12,2,12,24],[14,1,14,24],[16,2,16,24],[17,2,17,24],[18,2,18,24],[19,2,19,24],[21,1,21,24],[23,2,23,24],[25,1,25,24],[27,2,27,24],[28,2,28,24],[29,2,29,24],[30,2,30,24],[31,2,31,24],[32,2,32,24],[33,2,33,24],[35,1,35,24],[37,2,37,24],[38,2,38,24],[39,2,39,24],[40,2,40,24],[41,2,41,24],[42,2,42,24],[43,2,43,9],[43,10,43,12],[43,13,43,15],[43,16,43,18],[43,19,43,24],[44,2,44,9],[44,10,44,12],[44,13,44,15],[44,16,44,18],[44,19,44,24],[46,1,46,24],[48,2,48,24],[54,2,54,24],[57,2,57,24],[60,2,60,24],[63,2,63,24],[66,2,66,24],[67,2,67,24],[70,2,70,24]]}
[{"$f":"HLOOKUP(Language!$A$2,Language!$C$6:$D$543,3)","v":"Zulieferererklärung"}]
[]
[]
[null,{"$f":"HLOOKUP(Language!$A$2,Language!$C$6:$D$543,54)","v":"Hinweise für die Bearbeitung der Zulieferererklärung"}]
[]
[null,"¶",{"$f":"HLOOKUP(Language!$A$2,Language!$C$6:$D$543,55)","v":"Die Erklärung ist nach Zustellung innerhalb von 5 Arbeitstagen zurückzusenden."}]
[null,"¶",{"$f":"HLOOKUP(Language!$A$2,Language!$C$6:$D$543,56)","v":"Die Pflichtfelder sind durch eine gelbe Füllung gekennzeichnet und direkt in der Excel-Datei auszufüllen."}]
[null,"¶",{"$f":"HLOOKUP(Language!$A$2,Language!$C$6:$D$543,57)","v":"Das komplette Dokument ist mit Unterschrift im Dateiformat .pdf an den zuständigen Mitarbeiter im Einkauf und an die E-Mail Adresse environment@rzb-leuchten.de zu übermitteln."}]
[]
[null,{"$f":"HLOOKUP(Language!$A$2,Language!$C$6:$D$543,4)","v":"[1] Lieferant"}]
[]
[null,"¶",{"$f":"HLOOKUP(Language!$A$2,Language!$C$6:$D$543,59)","v":"Basisinformationen zum Lieferant."}]
[null,"¶",{"$f":"HLOOKUP(Language!$A$2,Language!$C$6:$D$543,60)","v":"Unter Kontaktperson ist eine zuständige Person gemeint, die fachlich in der Lage ist die Erklärung auszufüllen sowie auch bei Rückfragen kontaktiert werden kann."}]
[]
[null,{"$f":"HLOOKUP(Language!$A$2,Language!$C$6:$D$543,9)","v":"[2] Produkt"}]
[]
[null,"¶",{"$f":"HLOOKUP(Language!$A$2,Language!$C$6:$D$543,61)","v":"Die Zulieferererklärung muss produktbezogen erfolgen, daher sind die Produktinformationen vom Lieferanten und von RZB anzugeben."}]
[null,"¶",{"$f":"HLOOKUP(Language!$A$2,Language!$C$6:$D$543,62)","v":"Soll die Zulieferererklärung für mehrere Produkte/Produktgruppen genutzt werden, steht die Tablele \"List of purchased products\" zur Verfügung."}]
[null,"¶",{"$f":"HLOOKUP(Language!$A$2,Language!$C$6:$D$543,63)","v":"Alternativ können die vorhandenen Schaltflächen für einen Seitenwechsel genutzt werden."}]
[null,"¶",{"$f":"HLOOKUP(Language!$A$2,Language!$C$6:$D$543,64)","v":"Das Feld Zusätzliches Blatt ist entsprechend zu kennzeichnen."}]
[]
[null,{"$f":"HLOOKUP(Language!$A$2,Language!$C$6:$D$543,65)","v":"[3] Konformität und [4] Konformitätserklärung"}]
[]
[null,"¶",{"$f":"HLOOKUP(Language!$A$2,Language!$C$6:$D$543,66)","v":"Die beiden Tabellenspalten sind mit den Antworten aus der Dropdown-Liste zu füllen."}]
[]
[null,{"$f":"HLOOKUP(Language!$A$2,Language!$C$6:$D$543,67)","v":"[5] Bewertungsverfahren"}]
[]
[null,"¶",{"$f":"HLOOKUP(Language!$A$2,Language!$C$6:$D$543,68)","v":"Dient zur Einschätzung von RZB, welche technische Dokumentation für die Produkte verfügbar sind und wie hoch die Wahrscheinlichkeit ist, dass beschränkte Stoffe in den Produkten auftreten können. "}]
[null,"¶",{"$f":"HLOOKUP(Language!$A$2,Language!$C$6:$D$543,69)","v":"Die Tabellenspalte ist mittels den vorgegebenen Antworten in der Dropdown-Auswahlliste auszufüllen."}]
[null,"¶",{"$f":"HLOOKUP(Language!$A$2,Language!$C$6:$D$543,70)","v":"Folgende Antwortmöglichkeiten sind vorhanden:"}]
[null,"¶",{"$f":"HLOOKUP(Language!$A$2,Language!$C$6:$D$543,71)","v":"Vermutung (ohne Nachweis) es liegen keine Informationen vor und der Lieferant geht davon aus, dass keine dieser Stoffe vorhanden sind."}]
[null,"¶",{"$f":"HLOOKUP(Language!$A$2,Language!$C$6:$D$543,72)","v":"Eine Zulieferererklärung bestätigt, dass die Menge der beschränkten Stoffe in den Produkten innerhalb der erlaubten Höchstkonzentrationen liegt inklusive Angabe aller angewandten Ausnahmen."}]
[null,"¶",{"$f":"HLOOKUP(Language!$A$2,Language!$C$6:$D$543,73)","v":"Eine Materialdeklaration gibt Auskunft über die Menge der einzelnen Stoffe und listet alle angewandten Ausnahmen auf."}]
[null,"¶",{"$f":"HLOOKUP(Language!$A$2,Language!$C$6:$D$543,74)","v":"Eine Laboranalyse ist ein analytisches Prüfverfahren zur Bestimmung der Menge ausgewählter Stoffe. Die Analyse findet in einem Prüflabor statt."}]
[]
[null,{"$f":"HLOOKUP(Language!$A$2,Language!$C$6:$D$543,35)","v":"[6] Deklarationspflichtige Stoffe/Stoffgruppen*²"}]
[]
[null,"¶",{"$f":"HLOOKUP(Language!$A$2,Language!$C$6:$D$543,75)","v":"Das Feld ist auszufüllen, sobald eine Antwort in der Konformitätserklärung gegeben wird, die eine Erklärung über eingeschränkte oder verbotene Stoffe vorgibt."}]
[null,"¶",{"$f":"HLOOKUP(Language!$A$2,Language!$C$6:$D$543,76)","v":"Sollte die Anzahl der Stoffdeklarationen nicht genügen, steht das Tabellenblatt \"List of substance declarations\" zur Verfügung."}]
[null,"¶",{"$f":"HLOOKUP(Language!$A$2,Language!$C$6:$D$543,63)","v":"Alternativ können die vorhandenen Schaltflächen für einen Seitenwechsel genutzt werden."}]
{"$rows_left_out":32}
{"sheet":"Language","index":4,"n_rows":124,"n_cols":7,"rows_kept":124,"hidden":true}
[null,"Sprachwahl"]
[1,"Deutsch"]
[null,"Englisch"]
[null,null,1,2,3]
["Bemerkungen","0","Deutsch","Englisch","Sprache X"]
[null,"1",1,2,3]
[null,"2","So erstellen Sie die Zulieferererklärung.","How to enter the supplier declaration."]
[null,"3","Zulieferererklärung","Supplier declaration"]
[null,"4","[1] Lieferant","[1] Supplier"]
[null,"5","Firmenname","Company"]
[null,"6","Kontaktperson","Contact"]
[null,"7","Telefonnummer","Phone"]
[null,"8","E-Mail ","E-Mail"]
[null,"9","[2] Produkt","[2] Product"]
[null,"10","Zusätzliches Blatt*¹","Additional sheet*¹"]
[null,"11","Lieferant Materialnummer","Supplier item number"]
[null,"12","Lieferant Materialbezeichnung","Supplier item name"]
[null,"13","RZB Materialnummer","RZB item number"]
[null,"14","RZB Materialbezeichnung","RZB item name"]
[null,"15","Soll diese Erklärung für mehrere Produkte/ Produktgruppen genutzt werden, steht das Tabellenblatt \"List of purchased products\" zur Verfügung.","If this declartion to be used for several products/product groups, the spreadsheet \"List of purchased products\" is available."]
[null,"16","Hiermit bestätigten wir, dass das Produkt/ die Produkte die folgenden Rechtsvorschriften zur Beschränkung von gefährlichen Stoffen in Produkten einhält.","We hereby certify that the product(s) complies with the following legislation for the restriction of hazardous substances in products."]
[null,"17","Nr.","No."]
[null,"18","Rechtsvorschrift","Legislative provision"]
[null,"19","REACh Verordnung (EG) Nr. 1907/2006","REACh regulation (EC) No 1907/2006"]
["16-08-19","20","SVHC Kandidatenliste 16. Juni 2019 (201 Stoffe)","SVHC candidate list 16 July.2019 (201 substances)"]
["16-08-19","21","Anhang XIV plus Änderungen bis zum 13. Juni 2017","Annex XIV plus amendments per 13 June 2017"]
["16-08-19","22","Anhang XVII plus Änderungen bis zum 16. August 2019","Annex XVII plus amendments per 16 August 2019"]
[null,23,"Chemikalien-Verbotsverordnung ChemVerbotsV","Chemicals prohibition ordinance ChemVerbotsV"]
["16-08-19","24","POP Verordnung (EG) Nr. 2019/1021","POP regulation (EC) No 2019/1021"]
[null,"25","Verpackungsrichtlinie 94/62/EG","Packaging directive 94/62/EC"]
[null,"26","gilt für alle Verpackungsmaterialien für die Produktion und für Verkaufsprodukte.","applies to all packaging materials for production and sales products."]
["16-08-19","27","RoHS-Richtlinie 2011/65/EU inkl. (EU) 2015/863 ","RoHS directive 2011/65/EU incl. (EU) 2015/863"]
[null,"28","gilt für alle Zukaufprodukte die in Elektronikgeräte einfließen.","applies to all purchased products which are used in sales products."]
[null,"29","gilt für alle Zukaufprodukte und Verpackungen.","applies to all purchased products and packaging."]
[null,"30","Batterierichtlinie 2006/66/EG ","Battery directive 2006/66/EC"]
[null,"31","gilt für alle Batterien und Akkumulatoren, sofern keine Verwendung für Notbeleuchtung vorliegt.","applies to all batteries and accumulators, provided that there is no use for emergency lighting."]
[null,"32","Konformität ","Conformity"]
[null,"33","Konformitätserklärung ","Declaration of conformity "]
[null,"34","Bewertungs-verfahren","Evaluation procedures"]
[null,"35","[6] Deklarationspflichtige Stoffe/Stoffgruppen*²","[6] Substances/groups of substances subject to declaration requirements*²"]
{"$rows_left_out":84}